{"text_format":"1","workbook":"xlsx","n_sheets":6,"sheets":["Receipts","Payments","CashinTin","CodingSheet","Finance","Data"],"not_rendered":{"charts":0,"images":1,"macros":1,"external_links":0,"defined_names":6,"comments":0,"pivot_tables":0},"unopened":[],"bounds":{"document_bytes":16777216,"sheet_cells":100000,"rows_first":2000,"rows_last":500,"rows_between":2000,"halvings":0,"cell_chars":16384,"cell_head_chars":4096},"cells_cut":0,"cells_raw":0,"read":"whole","date_system":"1900"}

{"sheet":"Receipts","index":0,"n_rows":52,"n_cols":9,"rows_kept":52,"cut":false,"hidden":false,"merged":[]}
["Petty Cash Return"]
["Home:",null,"The Lodge"]
["Month:",null,"June"]
["Year:",null,2025]
["Reconciliation"]
["Balance brought forward",null,null,474.35]
["Add: Prior month reimbursement",null,null,425.65]
["Add: Current month receipts",null,null,{"$f":"+I52","v":0}]
["Less: Current month expenditure",null,null,{"$f":"-Payments!I53","v":0}]
["Balance carried forward",null,null,{"$f":"SUM(D6:D9)","v":900},{"$f":"IF(ROUND(CashinTin!B20,2)=ROUND(Receipts!D10,2), \"\", \"Out of balance by:\")","v":"Out of balance by:"}]
["Reimbursement required",null,null,{"$f":"D12-D10","v":0},{"$f":"IF(ROUND(D10,2)-ROUND(CashinTin!B20,2)=0,0,ROUND(D10,2)-ROUND(CashinTin!B20,2))","v":900}]
["Petty cash balance",null,null,900]
[]
["RECEIPTS"]
["Ref","Date","Description","Dept","Account","VAT Y/N","Net","VAT","Gross"]
[1,null,null,null,null,null,{"$f":"IF(F16=\"Y\",I16/1.2,I16)","v":0},{"$f":"+I16-G16","v":0}]
[{"$f":"+A16+1","v":2},null,null,null,null,null,{"$f":"IF(F17=\"Y\",I17/1.2,I17)","v":0},{"$f":"+I17-G17","v":0}]
[{"$f":"+A17+1","v":3},null,null,null,null,null,0,0]
[4,null,null,null,null,null,0,0]
[5,null,null,null,null,null,0,0]
[6,null,null,null,null,null,0,0]
[7,null,null,null,null,null,0,0]
[8,null,null,null,null,null,0,0]
[9,null,null,null,null,null,0,0]
[10,null,null,null,null,null,0,0]
[11,null,null,null,null,null,0,0]
[12,null,null,null,null,null,0,0]
[13,null,null,null,null,null,0,0]
[14,null,null,null,null,null,0,0]
[15,null,null,null,null,null,0,0]
[16,null,null,null,null,null,0,0]
[17,null,null,null,null,null,0,0]
[18,null,null,null,null,null,0,0]
[19,null,null,null,null,null,0,0]
[20,null,null,null,null,null,0,0]
[21,null,null,null,null,null,0,0]
[22,null,null,null,null,null,0,0]
[23,null,null,null,null,null,0,0]
[24,null,null,null,null,null,0,0]
[25,null,null,null,null,null,0,0]
{"$rows_left_out":13}
{"sheet":"Payments","index":1,"n_rows":53,"n_cols":9,"rows_kept":53,"cut":false,"hidden":false,"merged":[]}
["Petty Cash Return"]
["Home:",null,{"$f":"+Receipts!C2","v":"The Lodge"}]
["Month:",null,{"$f":"+Receipts!C3","v":"June"}]
["Year:",null,{"$f":"+Receipts!C4","v":2025}]
["PAYMENTS"]
["Ref","Date","Description","Dept","Account","VAT Y/N","Net","VAT","Gross"]
[1,null,null,null,null,null,{"$f":"IF(F7=\"Y\",I7/1.2,I7)","v":0},{"$f":"+I7-G7","v":0}]
[2,null,null,null,null,null,{"$f":"IF(F8=\"Y\",I8/1.2,I8)","v":0},{"$f":"+I8-G8","v":0}]
[3,null,null,null,null,null,0,0]
[4,null,null,null,null,null,0,0]
[5,null,null,null,null,null,0,0]
[6,null,null,null,null,null,0,0]
[7,null,null,null,null,null,0,0]
[8,null,null,null,null,null,0,0]
[9,null,null,null,null,null,0,0]
[10,null,null,null,null,null,0,0]
[11,null,null,null,null,null,0,{"$f":"+I17-G17","v":0}]
[12,null,null,null,null,null,0,0]
[13,null,null,null,null,null,0,0]
[14,null,null,null,null,null,0,0]
[15,null,null,null,null,null,0,0]
[16,null,null,null,null,null,0,0]
[17,null,null,null,null,null,0,0]
[18,null,null,null,null,null,0,0]
[19,null,null,null,null,null,0,0]
[20,null,null,null,null,null,0,0]
[21,null,null,null,null,null,0,0]
[22,null,null,null,null,null,0,0]
[23,null,null,null,null,null,0,0]
[24,null,null,null,null,null,0,0]
[25,null,null,null,null,null,0,0]
[26,null,null,null,null,null,0,0]
[27,null,null,null,null,null,0,0]
[28,null,null,null,null,null,0,0]
[29,null,null,null,null,null,0,0]
[30,null,null,null,null,null,0,0]
[31,null,null,null,null,null,0,0]
[32,null,null,null,null,null,0,0]
[33,null,null,null,null,null,0,0]
[34,null,null,null,null,null,0,0]
{"$rows_left_out":14}
{"sheet":"CashinTin","index":2,"n_rows":31,"n_cols":6,"rows_kept":31,"cut":false,"hidden":false,"merged":[]}
["Petty Cash Return"]
["Home:",{"$f":"+Receipts!C2","v":"The Lodge"}]
["Month:",{"$f":"+Receipts!C3","v":"June"}]
["Year:",{"$f":"+Receipts!C4","v":2025}]
["CASH IN TIN"]
["Denomination","Value"]
[50,0]
[20,0]
[10,0,null,"Period Receipts:",null,{"$f":"+Receipts!D8","v":0}]
[5,0]
[2,0,null,"Period Payments:",null,{"$f":"+Receipts!D9","v":0}]
[1,0]
[0.5,0,null,"Petty Cash Reconciled:",null,{"$f":"IF(Receipts!E11<>0,\"No\",\"Yes\")","v":"No"}]
[0.2,0]
[0.1,0]
[0.05,0]
[0.02,0]
[0.01,0]
[]
["Total Cash in hand",{"$f":"SUM(B7:B18)","v":0}]
[]
[]
[]
["Prepared by:"]
[]
[]
[]
["Approved by:"]
[]
[]
["Date:",{"$f":"TODAY()","v":"2025-09-29"}]

{"sheet":"CodingSheet","index":3,"n_rows":124,"n_cols":10,"rows_kept":124,"cut":false,"hidden":false,"merged":[]}
[null,"Dept","Code 1","Description","Code 2","Description",null,null,"Code","Department"]
[null,null,null,null,null,null,null,null,"25","Management"]
["Other Income",null,null,null,null,null,null,null,"30","Registered Nurse"]
["Staff/ Visitor Accommodation",70,11000,"Visitor Accommodation ",11010,"Staff Accommodation",null,null,"32","Care Assistant"]
["Other Including Staff & Visitor Meals","70/74",11020,"Employee Meals",null,null,null,null,"38","Medical"]
[null,null,null,null,null,null,null,null,"40","Catering"]
["Salary Expense",null,null,null,null,null,null,null,"44","Domestic"]
["Registered nurse - agency",30,20100,"Agency Staff",null,null,null,null,"48","Laundry"]
["Care Assistant - agency",32,20100,"Agency Staff",null,null,null,null,"55","Premises"]
["Catering - Agency",40,20100,"Agency Staff",null,null,null,null,"70","Employees"]
["Domestic - Agency",44,20100,"Agency Staff",null,null,null,null,"72","Residents"]
["Laundry - Agency",48,20100,"Agency Staff",null,null,null,null,"74","Visitors"]
["Maint/Garden - Agency",55,20100,"Agency Staff"]
[]
["Management"]
["Materials - General Item",25,27130,"Materials - General Items"]
["Hospitality - General",25,27230,"Residents Drinks"]
["Minor Maint. - Gen.",25,21050,"Minor Maintenance"]
["Service Ct. - General",25,23010,"Service Contracts - Other"]
["Service Cont. -  IT H/W",25,23020,"Service Contracts -  IT H/W"]
["Service Cont. -  IT S/W",25,23030,"Service Contracts -  IT S/W"]
["Registration - Care Home",25,26021,"Registration - Care Home (CQC)"]
["Subsrciptions",25,26020,"Organisational Subscriptions"]
["Advertising - (Home)",25,27220,"Advertising"]
["Admin. - Stationery",25,26040,"Stationery"]
["Admin. - Postage & Car./Distrib.",25,26030,"Postage"]
["Admin. - Telephone/Fax",25,26000,"Telephone"]
["Admin. - Data Communications",25,26010,"Data Communications"]
["Admin. - TV Licences",25,26060,"TV Licences"]
["Sundry - Flowers",25,27020,"Residents Flowers"]
["Sundry - Newsp./Periodicals",25,27080,"Newspapers etc"]
["Sundry - Other",25,27000,"Sundry"]
[]
["Catering"]
["Materials - General Item",40,27130,"Materials - General Items"]
["Hse Hold - Disposable",40,27150,"Disposables"]
["Hse Hold - Cleaning Mats.",40,27160,"Cleaning Materials"]
["Equip. Rental - General",40,27200,"Equipment Hire"]
["Minor Maint. - Plan. - Gen.",40,21050,"Minor Maintenance"]
["Service Ct. - General",40,23010,"Service Contracts - Other",23000,"Service Contracts -  Deep Clean"]
{"$rows_left_out":85}
{"sheet":"Finance","index":4,"n_rows":84,"n_cols":11,"rows_kept":84,"cut":false,"hidden":false,"merged":[]}
["TS","Posted","Account","Project","Cost centre","Department","Text","XGL","TaxRule","Invoice","Amount"]
["GL",{"$f":"Data!K15","v":"30/6/2025"},"05000","Care Homes",{"$f":"VLOOKUP(Receipts!C$2,Data!$H$2:$I$9,2)","v":"LD"},"01",{"$f":"\"Petty Cash \"&Receipts!C2&\" \"&Receipts!C3","v":"Petty Cash The Lodge June"},"Unrestricted","NV",{"$f":"SUM(Receipts!D8:D9)","v":0},{"$f":"+J2","v":0}]
["GL","31/10/2023",{"$f":"VLOOKUP(Receipts!E16,Data!$A$2:$C$42,2,FALSE)","v":{"$error":"#N/A"}},"Care Homes",{"$f":"VLOOKUP(Receipts!C$2,Data!$H$2:$I$9,2)","v":"LD"},{"$f":"VLOOKUP(Receipts!D16,Data!$E$2:$F$18,2,FALSE)","v":{"$error":"#N/A"}},{"$f":"Receipts!C16","v":0},"Unrestricted",{"$f":"VLOOKUP(Receipts!E16,Data!$A$2:$C$42,3,FALSE)","v":{"$error":"#N/A"}},{"$f":"-Receipts!I16","v":0},{"$f":"+J3","v":0}]
["GL","31/10/2023",{"$f":"VLOOKUP(Receipts!E17,Data!$A$2:$C$42,2,FALSE)","v":{"$error":"#N/A"}},"Care Homes",{"$f":"VLOOKUP(Receipts!C$2,Data!$H$2:$I$9,2)","v":"LD"},{"$f":"VLOOKUP(Receipts!D17,Data!$E$2:$F$18,2,FALSE)","v":{"$error":"#N/A"}},{"$f":"Receipts!C17","v":0},"Unrestricted",{"$f":"VLOOKUP(Receipts!E17,Data!$A$2:$C$42,3,FALSE)","v":{"$error":"#N/A"}},{"$f":"-Receipts!I17","v":0},0]
["GL","31/10/2023",{"$f":"VLOOKUP(Receipts!E18,Data!$A$2:$C$42,2,FALSE)","v":{"$error":"#N/A"}},"Care Homes",{"$f":"VLOOKUP(Receipts!C$2,Data!$H$2:$I$9,2)","v":"LD"},{"$f":"VLOOKUP(Receipts!D18,Data!$E$2:$F$18,2,FALSE)","v":{"$error":"#N/A"}},{"$f":"Receipts!C18","v":0},"Unrestricted",{"$f":"VLOOKUP(Receipts!E18,Data!$A$2:$C$42,3,FALSE)","v":{"$error":"#N/A"}},{"$f":"-Receipts!I18","v":0},0]
["GL","31/10/2023",{"$f":"VLOOKUP(Receipts!E19,Data!$A$2:$C$42,2,FALSE)","v":{"$error":"#N/A"}},"Care Homes",{"$f":"VLOOKUP(Receipts!C$2,Data!$H$2:$I$9,2)","v":"LD"},{"$f":"VLOOKUP(Receipts!D19,Data!$E$2:$F$18,2,FALSE)","v":{"$error":"#N/A"}},{"$f":"Receipts!C19","v":0},"Unrestricted",{"$f":"VLOOKUP(Receipts!E19,Data!$A$2:$C$42,3,FALSE)","v":{"$error":"#N/A"}},{"$f":"-Receipts!I19","v":0},0]
["GL","31/10/2023",{"$f":"VLOOKUP(Receipts!E20,Data!$A$2:$C$42,2,FALSE)","v":{"$error":"#N/A"}},"Care Homes",{"$f":"VLOOKUP(Receipts!C$2,Data!$H$2:$I$9,2)","v":"LD"},{"$f":"VLOOKUP(Receipts!D20,Data!$E$2:$F$18,2,FALSE)","v":{"$error":"#N/A"}},{"$f":"Receipts!C20","v":0},"Unrestricted",{"$f":"VLOOKUP(Receipts!E20,Data!$A$2:$C$42,3,FALSE)","v":{"$error":"#N/A"}},{"$f":"-Receipts!I20","v":0},0]
["GL","31/10/2023",{"$f":"VLOOKUP(Receipts!E21,Data!$A$2:$C$42,2,FALSE)","v":{"$error":"#N/A"}},"Care Homes",{"$f":"VLOOKUP(Receipts!C$2,Data!$H$2:$I$9,2)","v":"LD"},{"$f":"VLOOKUP(Receipts!D21,Data!$E$2:$F$18,2,FALSE)","v":{"$error":"#N/A"}},{"$f":"Receipts!C21","v":0},"Unrestricted",{"$f":"VLOOKUP(Receipts!E21,Data!$A$2:$C$42,3,FALSE)","v":{"$error":"#N/A"}},{"$f":"-Receipts!I21","v":0},0]
["GL","31/10/2023",{"$f":"VLOOKUP(Receipts!E22,Data!$A$2:$C$42,2,FALSE)","v":{"$error":"#N/A"}},"Care Homes",{"$f":"VLOOKUP(Receipts!C$2,Data!$H$2:$I$9,2)","v":"LD"},{"$f":"VLOOKUP(Receipts!D22,Data!$E$2:$F$18,2,FALSE)","v":{"$error":"#N/A"}},{"$f":"Receipts!C22","v":0},"Unrestricted",{"$f":"VLOOKUP(Receipts!E22,Data!$A$2:$C$42,3,FALSE)","v":{"$error":"#N/A"}},{"$f":"-Receipts!I22","v":0},0]
["GL","31/10/2023",{"$f":"VLOOKUP(Receipts!E23,Data!$A$2:$C$42,2,FALSE)","v":{"$error":"#N/A"}},"Care Homes",{"$f":"VLOOKUP(Receipts!C$2,Data!$H$2:$I$9,2)","v":"LD"},{"$f":"VLOOKUP(Receipts!D23,Data!$E$2:$F$18,2,FALSE)","v":{"$error":"#N/A"}},{"$f":"Receipts!C23","v":0},"Unrestricted",{"$f":"VLOOKUP(Receipts!E23,Data!$A$2:$C$42,3,FALSE)","v":{"$error":"#N/A"}},{"$f":"-Receipts!I23","v":0},0]
["GL","31/10/2023",{"$f":"VLOOKUP(Receipts!E24,Data!$A$2:$C$42,2,FALSE)","v":{"$error":"#N/A"}},"Care Homes",{"$f":"VLOOKUP(Receipts!C$2,Data!$H$2:$I$9,2)","v":"LD"},{"$f":"VLOOKUP(Receipts!D24,Data!$E$2:$F$18,2,FALSE)","v":{"$error":"#N/A"}},{"$f":"Receipts!C24","v":0},"Unrestricted",{"$f":"VLOOKUP(Receipts!E24,Data!$A$2:$C$42,3,FALSE)","v":{"$error":"#N/A"}},{"$f":"-Receipts!I24","v":0},0]
["GL","31/10/2023",{"$f":"VLOOKUP(Receipts!E25,Data!$A$2:$C$42,2,FALSE)","v":{"$error":"#N/A"}},"Care Homes",{"$f":"VLOOKUP(Receipts!C$2,Data!$H$2:$I$9,2)","v":"LD"},{"$f":"VLOOKUP(Receipts!D25,Data!$E$2:$F$18,2,FALSE)","v":{"$error":"#N/A"}},{"$f":"Receipts!C25","v":0},"Unrestricted",{"$f":"VLOOKUP(Receipts!E25,Data!$A$2:$C$42,3,FALSE)","v":{"$error":"#N/A"}},{"$f":"-Receipts!I25","v":0},0]
["GL","31/10/2023",{"$f":"VLOOKUP(Receipts!E26,Data!$A$2:$C$42,2,FALSE)","v":{"$error":"#N/A"}},"Care Homes",{"$f":"VLOOKUP(Receipts!C$2,Data!$H$2:$I$9,2)","v":"LD"},{"$f":"VLOOKUP(Receipts!D26,Data!$E$2:$F$18,2,FALSE)","v":{"$error":"#N/A"}},{"$f":"Receipts!C26","v":0},"Unrestricted",{"$f":"VLOOKUP(Receipts!E26,Data!$A$2:$C$42,3,FALSE)","v":{"$error":"#N/A"}},{"$f":"-Receipts!I26","v":0},0]
["GL","31/10/2023",{"$f":"VLOOKUP(Receipts!E27,Data!$A$2:$C$42,2,FALSE)","v":{"$error":"#N/A"}},"Care Homes",{"$f":"VLOOKUP(Receipts!C$2,Data!$H$2:$I$9,2)","v":"LD"},{"$f":"VLOOKUP(Receipts!D27,Data!$E$2:$F$18,2,FALSE)","v":{"$error":"#N/A"}},{"$f":"Receipts!C27","v":0},"Unrestricted",{"$f":"VLOOKUP(Receipts!E27,Data!$A$2:$C$42,3,FALSE)","v":{"$error":"#N/A"}},{"$f":"-Receipts!I27","v":0},0]
["GL","31/10/2023",{"$f":"VLOOKUP(Receipts!E28,Data!$A$2:$C$42,2,FALSE)","v":{"$error":"#N/A"}},"Care Homes",{"$f":"VLOOKUP(Receipts!C$2,Data!$H$2:$I$9,2)","v":"LD"},{"$f":"VLOOKUP(Receipts!D28,Data!$E$2:$F$18,2,FALSE)","v":{"$error":"#N/A"}},{"$f":"Receipts!C28","v":0},"Unrestricted",{"$f":"VLOOKUP(Receipts!E28,Data!$A$2:$C$42,3,FALSE)","v":{"$error":"#N/A"}},{"$f":"-Receipts!I28","v":0},0]
["GL","31/10/2023",{"$f":"VLOOKUP(Receipts!E29,Data!$A$2:$C$42,2,FALSE)","v":{"$error":"#N/A"}},"Care Homes",{"$f":"VLOOKUP(Receipts!C$2,Data!$H$2:$I$9,2)","v":"LD"},{"$f":"VLOOKUP(Receipts!D29,Data!$E$2:$F$18,2,FALSE)","v":{"$error":"#N/A"}},{"$f":"Receipts!C29","v":0},"Unrestricted",{"$f":"VLOOKUP(Receipts!E29,Data!$A$2:$C$42,3,FALSE)","v":{"$error":"#N/A"}},{"$f":"-Receipts!I29","v":0},0]
["GL","31/10/2023",{"$f":"VLOOKUP(Receipts!E30,Data!$A$2:$C$42,2,FALSE)","v":{"$error":"#N/A"}},"Care Homes",{"$f":"VLOOKUP(Receipts!C$2,Data!$H$2:$I$9,2)","v":"LD"},{"$f":"VLOOKUP(Receipts!D30,Data!$E$2:$F$18,2,FALSE)","v":{"$error":"#N/A"}},{"$f":"Receipts!C30","v":0},"Unrestricted",{"$f":"VLOOKUP(Receipts!E30,Data!$A$2:$C$42,3,FALSE)","v":{"$error":"#N/A"}},{"$f":"-Receipts!I30","v":0},0]
["GL","31/10/2023",{"$f":"VLOOKUP(Receipts!E31,Data!$A$2:$C$42,2,FALSE)","v":{"$error":"#N/A"}},"Care Homes",{"$f":"VLOOKUP(Receipts!C$2,Data!$H$2:$I$9,2)","v":"LD"},{"$f":"VLOOKUP(Receipts!D31,Data!$E$2:$F$18,2,FALSE)","v":{"$error":"#N/A"}},{"$f":"Receipts!C31","v":0},"Unrestricted",{"$f":"VLOOKUP(Receipts!E31,Data!$A$2:$C$42,3,FALSE)","v":{"$error":"#N/A"}},{"$f":"-Receipts!I31","v":0},0]
["GL","31/10/2023",{"$f":"VLOOKUP(Receipts!E32,Data!$A$2:$C$42,2,FALSE)","v":{"$error":"#N/A"}},"Care Homes",{"$f":"VLOOKUP(Receipts!C$2,Data!$H$2:$I$9,2)","v":"LD"},{"$f":"VLOOKUP(Receipts!D32,Data!$E$2:$F$18,2,FALSE)","v":{"$error":"#N/A"}},{"$f":"Receipts!C32","v":0},"Unrestricted",{"$f":"VLOOKUP(Receipts!E32,Data!$A$2:$C$42,3,FALSE)","v":{"$error":"#N/A"}},{"$f":"-Receipts!I32","v":0},0]
["GL","31/10/2023",{"$f":"VLOOKUP(Receipts!E33,Data!$A$2:$C$42,2,FALSE)","v":{"$error":"#N/A"}},"Care Homes",{"$f":"VLOOKUP(Receipts!C$2,Data!$H$2:$I$9,2)","v":"LD"},{"$f":"VLOOKUP(Receipts!D33,Data!$E$2:$F$18,2,FALSE)","v":{"$error":"#N/A"}},{"$f":"Receipts!C33","v":0},"Unrestricted",{"$f":"VLOOKUP(Receipts!E33,Data!$A$2:$C$42,3,FALSE)","v":{"$error":"#N/A"}},{"$f":"-Receipts!I33","v":0},0]
["GL","31/10/2023",{"$f":"VLOOKUP(Receipts!E34,Data!$A$2:$C$42,2,FALSE)","v":{"$error":"#N/A"}},"Care Homes",{"$f":"VLOOKUP(Receipts!C$2,Data!$H$2:$I$9,2)","v":"LD"},{"$f":"VLOOKUP(Receipts!D34,Data!$E$2:$F$18,2,FALSE)","v":{"$error":"#N/A"}},{"$f":"Receipts!C34","v":0},"Unrestricted",{"$f":"VLOOKUP(Receipts!E34,Data!$A$2:$C$42,3,FALSE)","v":{"$error":"#N/A"}},{"$f":"-Receipts!I34","v":0},0]
["GL","31/10/2023",{"$f":"VLOOKUP(Receipts!E35,Data!$A$2:$C$42,2,FALSE)","v":{"$error":"#N/A"}},"Care Homes",{"$f":"VLOOKUP(Receipts!C$2,Data!$H$2:$I$9,2)","v":"LD"},{"$f":"VLOOKUP(Receipts!D35,Data!$E$2:$F$18,2,FALSE)","v":{"$error":"#N/A"}},{"$f":"Receipts!C35","v":0},"Unrestricted",{"$f":"VLOOKUP(Receipts!E35,Data!$A$2:$C$42,3,FALSE)","v":{"$error":"#N/A"}},{"$f":"-Receipts!I35","v":0},0]
["GL","31/10/2023",{"$f":"VLOOKUP(Receipts!E36,Data!$A$2:$C$42,2,FALSE)","v":{"$error":"#N/A"}},"Care Homes",{"$f":"VLOOKUP(Receipts!C$2,Data!$H$2:$I$9,2)","v":"LD"},{"$f":"VLOOKUP(Receipts!D36,Data!$E$2:$F$18,2,FALSE)","v":{"$error":"#N/A"}},{"$f":"Receipts!C36","v":0},"Unrestricted",{"$f":"VLOOKUP(Receipts!E36,Data!$A$2:$C$42,3,FALSE)","v":{"$error":"#N/A"}},{"$f":"-Receipts!I36","v":0},0]
["GL","31/10/2023",{"$f":"VLOOKUP(Receipts!E37,Data!$A$2:$C$42,2,FALSE)","v":{"$error":"#N/A"}},"Care Homes",{"$f":"VLOOKUP(Receipts!C$2,Data!$H$2:$I$9,2)","v":"LD"},{"$f":"VLOOKUP(Receipts!D37,Data!$E$2:$F$18,2,FALSE)","v":{"$error":"#N/A"}},{"$f":"Receipts!C37","v":0},"Unrestricted",{"$f":"VLOOKUP(Receipts!E37,Data!$A$2:$C$42,3,FALSE)","v":{"$error":"#N/A"}},{"$f":"-Receipts!I37","v":0},0]
["GL","31/10/2023",{"$f":"VLOOKUP(Receipts!E38,Data!$A$2:$C$42,2,FALSE)","v":{"$error":"#N/A"}},"Care Homes",{"$f":"VLOOKUP(Receipts!C$2,Data!$H$2:$I$9,2)","v":"LD"},{"$f":"VLOOKUP(Receipts!D38,Data!$E$2:$F$18,2,FALSE)","v":{"$error":"#N/A"}},{"$f":"Receipts!C38","v":0},"Unrestricted",{"$f":"VLOOKUP(Receipts!E38,Data!$A$2:$C$42,3,FALSE)","v":{"$error":"#N/A"}},{"$f":"-Receipts!I38","v":0},0]
["GL","31/10/2023",{"$f":"VLOOKUP(Receipts!E39,Data!$A$2:$C$42,2,FALSE)","v":{"$error":"#N/A"}},"Care Homes",{"$f":"VLOOKUP(Receipts!C$2,Data!$H$2:$I$9,2)","v":"LD"},{"$f":"VLOOKUP(Receipts!D39,Data!$E$2:$F$18,2,FALSE)","v":{"$error":"#N/A"}},{"$f":"Receipts!C39","v":0},"Unrestricted",{"$f":"VLOOKUP(Receipts!E39,Data!$A$2:$C$42,3,FALSE)","v":{"$error":"#N/A"}},{"$f":"-Receipts!I39","v":0},0]
["GL","31/10/2023",{"$f":"VLOOKUP(Receipts!E40,Data!$A$2:$C$42,2,FALSE)","v":{"$error":"#N/A"}},"Care Homes",{"$f":"VLOOKUP(Receipts!C$2,Data!$H$2:$I$9,2)","v":"LD"},{"$f":"VLOOKUP(Receipts!D40,Data!$E$2:$F$18,2,FALSE)","v":{"$error":"#N/A"}},{"$f":"Receipts!C40","v":0},"Unrestricted",{"$f":"VLOOKUP(Receipts!E40,Data!$A$2:$C$42,3,FALSE)","v":{"$error":"#N/A"}},{"$f":"-Receipts!I40","v":0},0]
["GL","31/10/2023",{"$f":"VLOOKUP(Receipts!E41,Data!$A$2:$C$42,2,FALSE)","v":{"$error":"#N/A"}},"Care Homes",{"$f":"VLOOKUP(Receipts!C$2,Data!$H$2:$I$9,2)","v":"LD"},{"$f":"VLOOKUP(Receipts!D41,Data!$E$2:$F$18,2,FALSE)","v":{"$error":"#N/A"}},{"$f":"Receipts!C41","v":0},"Unrestricted",{"$f":"VLOOKUP(Receipts!E41,Data!$A$2:$C$42,3,FALSE)","v":{"$error":"#N/A"}},{"$f":"-Receipts!I41","v":0},0]
["GL","31/10/2023",{"$f":"VLOOKUP(Receipts!E42,Data!$A$2:$C$42,2,FALSE)","v":{"$error":"#N/A"}},"Care Homes",{"$f":"VLOOKUP(Receipts!C$2,Data!$H$2:$I$9,2)","v":"LD"},{"$f":"VLOOKUP(Receipts!D42,Data!$E$2:$F$18,2,FALSE)","v":{"$error":"#N/A"}},{"$f":"Receipts!C42","v":0},"Unrestricted",{"$f":"VLOOKUP(Receipts!E42,Data!$A$2:$C$42,3,FALSE)","v":{"$error":"#N/A"}},{"$f":"-Receipts!I42","v":0},0]
["GL","31/10/2023",{"$f":"VLOOKUP(Receipts!E43,Data!$A$2:$C$42,2,FALSE)","v":{"$error":"#N/A"}},"Care Homes",{"$f":"VLOOKUP(Receipts!C$2,Data!$H$2:$I$9,2)","v":"LD"},{"$f":"VLOOKUP(Receipts!D43,Data!$E$2:$F$18,2,FALSE)","v":{"$error":"#N/A"}},{"$f":"Receipts!C43","v":0},"Unrestricted",{"$f":"VLOOKUP(Receipts!E43,Data!$A$2:$C$42,3,FALSE)","v":{"$error":"#N/A"}},{"$f":"-Receipts!I43","v":0},0]
["GL","31/10/2023",{"$f":"VLOOKUP(Receipts!E44,Data!$A$2:$C$42,2,FALSE)","v":{"$error":"#N/A"}},"Care Homes",{"$f":"VLOOKUP(Receipts!C$2,Data!$H$2:$I$9,2)","v":"LD"},{"$f":"VLOOKUP(Receipts!D44,Data!$E$2:$F$18,2,FALSE)","v":{"$error":"#N/A"}},{"$f":"Receipts!C44","v":0},"Unrestricted",{"$f":"VLOOKUP(Receipts!E44,Data!$A$2:$C$42,3,FALSE)","v":{"$error":"#N/A"}},{"$f":"-Receipts!I44","v":0},0]
["GL","31/10/2023",{"$f":"VLOOKUP(Receipts!E45,Data!$A$2:$C$42,2,FALSE)","v":{"$error":"#N/A"}},"Care Homes",{"$f":"VLOOKUP(Receipts!C$2,Data!$H$2:$I$9,2)","v":"LD"},{"$f":"VLOOKUP(Receipts!D45,Data!$E$2:$F$18,2,FALSE)","v":{"$error":"#N/A"}},{"$f":"Receipts!C45","v":0},"Unrestricted",{"$f":"VLOOKUP(Receipts!E45,Data!$A$2:$C$42,3,FALSE)","v":{"$error":"#N/A"}},{"$f":"-Receipts!I45","v":0},0]
["GL","31/10/2023",{"$f":"VLOOKUP(Receipts!E46,Data!$A$2:$C$42,2,FALSE)","v":{"$error":"#N/A"}},"Care Homes",{"$f":"VLOOKUP(Receipts!C$2,Data!$H$2:$I$9,2)","v":"LD"},{"$f":"VLOOKUP(Receipts!D46,Data!$E$2:$F$18,2,FALSE)","v":{"$error":"#N/A"}},{"$f":"Receipts!C46","v":0},"Unrestricted",{"$f":"VLOOKUP(Receipts!E46,Data!$A$2:$C$42,3,FALSE)","v":{"$error":"#N/A"}},{"$f":"-Receipts!I46","v":0},0]
["GL","31/10/2023",{"$f":"VLOOKUP(Receipts!E47,Data!$A$2:$C$42,2,FALSE)","v":{"$error":"#N/A"}},"Care Homes",{"$f":"VLOOKUP(Receipts!C$2,Data!$H$2:$I$9,2)","v":"LD"},{"$f":"VLOOKUP(Receipts!D47,Data!$E$2:$F$18,2,FALSE)","v":{"$error":"#N/A"}},{"$f":"Receipts!C47","v":0},"Unrestricted",{"$f":"VLOOKUP(Receipts!E47,Data!$A$2:$C$42,3,FALSE)","v":{"$error":"#N/A"}},{"$f":"-Receipts!I47","v":0},0]
["GL","31/10/2023",{"$f":"VLOOKUP(Receipts!E48,Data!$A$2:$C$42,2,FALSE)","v":{"$error":"#N/A"}},"Care Homes",{"$f":"VLOOKUP(Receipts!C$2,Data!$H$2:$I$9,2)","v":"LD"},{"$f":"VLOOKUP(Receipts!D48,Data!$E$2:$F$18,2,FALSE)","v":{"$error":"#N/A"}},{"$f":"Receipts!C48","v":0},"Unrestricted",{"$f":"VLOOKUP(Receipts!E48,Data!$A$2:$C$42,3,FALSE)","v":{"$error":"#N/A"}},{"$f":"-Receipts!I48","v":0},0]
["GL","31/10/2023",{"$f":"VLOOKUP(Receipts!E49,Data!$A$2:$C$42,2,FALSE)","v":{"$error":"#N/A"}},"Care Homes",{"$f":"VLOOKUP(Receipts!C$2,Data!$H$2:$I$9,2)","v":"LD"},{"$f":"VLOOKUP(Receipts!D49,Data!$E$2:$F$18,2,FALSE)","v":{"$error":"#N/A"}},{"$f":"Receipts!C49","v":0},"Unrestricted",{"$f":"VLOOKUP(Receipts!E49,Data!$A$2:$C$42,3,FALSE)","v":{"$error":"#N/A"}},{"$f":"-Receipts!I49","v":0},0]
["GL","31/10/2023",{"$f":"VLOOKUP(Receipts!E50,Data!$A$2:$C$42,2,FALSE)","v":{"$error":"#N/A"}},"Care Homes",{"$f":"VLOOKUP(Receipts!C$2,Data!$H$2:$I$9,2)","v":"LD"},{"$f":"VLOOKUP(Receipts!D50,Data!$E$2:$F$18,2,FALSE)","v":{"$error":"#N/A"}},{"$f":"Receipts!C50","v":0},"Unrestricted",{"$f":"VLOOKUP(Receipts!E50,Data!$A$2:$C$42,3,FALSE)","v":{"$error":"#N/A"}},{"$f":"-Receipts!I50","v":0},0]
["GL","31/10/2023",{"$f":"VLOOKUP(Receipts!E51,Data!$A$2:$C$42,2,FALSE)","v":{"$error":"#N/A"}},"Care Homes",{"$f":"VLOOKUP(Receipts!C$2,Data!$H$2:$I$9,2)","v":"LD"},{"$f":"VLOOKUP(Receipts!D51,Data!$E$2:$F$18,2,FALSE)","v":{"$error":"#N/A"}},{"$f":"Receipts!C51","v":0},"Unrestricted",{"$f":"VLOOKUP(Receipts!E51,Data!$A$2:$C$42,3,FALSE)","v":{"$error":"#N/A"}},{"$f":"-Receipts!I51","v":0},0]
["GL","31/10/2023",{"$f":"VLOOKUP(Payments!E7,Data!$A$2:$C$42,2,FALSE)","v":{"$error":"#N/A"}},"Care Homes",{"$f":"VLOOKUP(Receipts!C$2,Data!$H$2:$I$9,2)","v":"LD"},{"$f":"VLOOKUP(Payments!D7,Data!$E$2:$F$18,2,FALSE)","v":{"$error":"#N/A"}},{"$f":"Payments!C7","v":0},"Unrestricted",{"$f":"VLOOKUP(Payments!E7,Data!$A$2:$C$42,3,FALSE)","v":{"$error":"#N/A"}},{"$f":"Payments!I7","v":0},0]
["GL","31/10/2023",{"$f":"VLOOKUP(Payments!E8,Data!$A$2:$C$42,2,FALSE)","v":{"$error":"#N/A"}},"Care Homes",{"$f":"VLOOKUP(Receipts!C$2,Data!$H$2:$I$9,2)","v":"LD"},{"$f":"VLOOKUP(Payments!D8,Data!$E$2:$F$18,2,FALSE)","v":{"$error":"#N/A"}},{"$f":"Payments!C8","v":0},"Unrestricted",{"$f":"VLOOKUP(Payments!E8,Data!$A$2:$C$42,3,FALSE)","v":{"$error":"#N/A"}},{"$f":"Payments!I8","v":0},0]
{"$rows_left_out":45}
{"sheet":"Data","index":5,"n_rows":42,"n_cols":13,"rows_kept":42,"cut":false,"hidden":true,"merged":[]}
["A.Lookup","Account","VAT",null,"D.Lookup","Department",null,"H.Lookup","Dept",null,"M.Lookup","Day","Mth"]
["Income - Other","10040","ZO",null,"Management","25",null,"The Cotswold","CW",null,"April",30,4]
["Income - Accommodation","11010","SO",null,"RN","30",null,"Eversfield","EF",null,"May",31,5]
["Income - Meals","11020","SO",null,"CA","32",null,"Grove Court","GC",null,"June",30,6]
["Advertising","27220","ZI",null,"Medical","38",null,"Halliwell","HW",null,"July",31,7]
["Cleaning Materials","27160","ZI",null,"Catering","40",null,"Merlewood","MW",null,"August",31,8]
["Disposables","27150","ZI",null,"Domestic","44",null,"Rashwood","RW",null,"September",30,9]
["Dry Cleaning","27140","ZI",null,"Laundry","48",null,"Rush Court","RC",null,"October",31,10]
["Employee Holiday Party","20280","ZI",null,"Premises","55",null,"The Lodge","LD",null,"November",30,11]
["Equipment - IT H/W","24040","ZI",null,"Employees","70",null,null,null,null,"December",31,12]
["Equipment Hire","27200","ZI",null,"Residents","72",null,null,null,null,"January",31,1]
["Food","27070","ZI",null,"Visitors","74",null,null,null,null,"February",28,2]
["Fuel","27250","ZI",null,"HO - Finance","03",null,null,null,null,"March",31,3]
["Furniture","24010","ZI",null,"HO - Homes","04"]
["H&S - First Aid","27170","ZI",null,"HO - HR","10",null,null,null,null,{"$f":"VLOOKUP(Receipts!C3,Data!$K$2:$M$13,2,FALSE)&\"/\"&VLOOKUP(Receipts!C3,Data!$K$2:$M$13,3,FALSE)&\"/\"&Receipts!C4","v":"30/6/2025"}]
["Hospitality","20290","ZI",null,"HO - Property","11"]
["Kitchen supplies","26070","ZI",null,"HO - Premises","12"]
["Landscape Maintenance","21055","ZI",null,"HO - IT","13"]
["Materials - General Items","27130","ZI"]
["Meetings & Events","27230","ZI"]
["Minor Maintenance","21050","ZI"]
["Mobile phones","20260","ZI"]
["Newspapers etc","27080","ZI"]
["Postage","26030","ZI"]
["Property - Other","21030","ZI"]
["Refuse","21060","ZI"]
["Resident - Beverages","27040","ZI"]
["Residents Drinks","27030","ZI"]
["Residents Flowers","27020","ZI"]
["Residents Xmas Fare","27060","ZI"]
["Residents Xmas Gift","27050","ZI"]
["Stationery (Office Supplies)","26040","ZI"]
["Sub. - Food & Bev.","20253","ZI"]
["Sub. - Hotel/Accomd.","20252","ZI"]
["Sundry","27000","ZI"]
["Supplies - Continence","27110","ZI"]
["Supplies - Nursing","27100","ZI"]
["Supplies - Other","27120","ZI"]
["Training Materials","20211","ZI"]
["Travel - Other","20250","ZI"]
{"$rows_left_out":2}